Apprentice Certificate
type: Class
comment: Credential awarded at the Apprentice level for successful completion of an apprenticeship program in industry trades and professions.
term status: stable
change history: https://credreg.net/ctdl/termhistory/ceterms/ApprenticeshipCertificate/json
subclass of: WorkBasedLearningCertificate
domain for: accreditedBy
domain for: accreditedIn
domain for: administrationProcess
domain for: advancedStandingFrom
domain for: aggregateData
domain for: alternateName
domain for: appealProcess
domain for: approvedBy
domain for: approvedIn
domain for: assessmentDeliveryType
domain for: atLevel
domain for: audienceLevelType
domain for: audienceType
domain for: availabilityListing
domain for: availableAt
domain for: availableOnlineAt
domain for: broadAlignment
domain for: classification
domain for: commonConditions
domain for: commonCosts
domain for: complaintProcess
domain for: coPrerequisite
domain for: copyrightHolder
domain for: corequisite
domain for: credentialId
domain for: credentialStatusType
domain for: credentialType
domain for: ctid
domain for: dateEffective
domain for: description
domain for: developmentProcess
domain for: earnings
domain for: employmentOutcome
domain for: estimatedCost
domain for: estimatedDuration
domain for: exactAlignment
domain for: expirationDate
domain for: financialAssistance
domain for: hasPart
domain for: hasProxy
domain for: hasRubric
domain for: hasSupportService
domain for: holders
domain for: identifier
domain for: image
domain for: inCatalog
domain for: industryType
domain for: inLanguage
domain for: instructionalProgramType
domain for: isAdvancedStandingFor
domain for: isicV4
domain for: isNonCredit
domain for: isPartOf
domain for: isPreparationFor
domain for: isRecommendedFor
domain for: isRegisteredApprenticeship
domain for: isRequiredFor
domain for: jurisdiction
domain for: keyword
domain for: latestVersion
domain for: learningDeliveryType
domain for: learningMethodDescription
domain for: learningMethodType
domain for: maintenanceProcess
domain for: majorAlignment
domain for: minorAlignment
domain for: naics
domain for: name
domain for: narrowAlignment
domain for: nextVersion
domain for: objectOfAction
domain for: occupationType
domain for: offeredBy
domain for: offeredIn