Bachelor's Degree
type: Class
comment: College/university award for students typically completing three to five years of education where course work and activities advance skills beyond those of the first one to two years of college/university study.
description: Equivalent to an award at UNESCO ISCED 2011, Level 6.
usage note: Use for 5-year cooperative (work-study) programs. A cooperative plan provides for alternate class attendance and employment in business, industry, or government; thus, it allows students to combine actual work experience with their college studies. Also includes bachelor's degrees in which the normal 4 years of work are completed in 3 years.
term status: stable
change history: https://credreg.net/ctdl/termhistory/ceterms/BachelorDegree/json
subclass of: Degree
domain for: accreditedBy
domain for: accreditedIn
domain for: administrationProcess
domain for: advancedStandingFrom
domain for: aggregateData
domain for: alternateName
domain for: appealProcess
domain for: approvedBy
domain for: approvedIn
domain for: assessmentDeliveryType
domain for: audienceLevelType
domain for: audienceType
domain for: availabilityListing
domain for: availableAt
domain for: availableOnlineAt
domain for: broadAlignment
domain for: commonConditions
domain for: commonCosts
domain for: complaintProcess
domain for: copyrightHolder
domain for: corequisite
domain for: credentialId
domain for: credentialStatusType
domain for: ctid
domain for: dateEffective
domain for: degreeConcentration
domain for: degreeMajor
domain for: degreeMinor
domain for: description
domain for: developmentProcess
domain for: earnings
domain for: employmentOutcome
domain for: estimatedCost
domain for: estimatedDuration
domain for: exactAlignment
domain for: expirationDate
domain for: financialAssistance
domain for: hasPart
domain for: holders
domain for: identifier
domain for: image
domain for: industryType
domain for: inLanguage
domain for: instructionalProgramType
domain for: isAdvancedStandingFor
domain for: isicV4
domain for: isPartOf
domain for: isPreparationFor
domain for: isRecommendedFor
domain for: isRequiredFor
domain for: jurisdiction
domain for: keyword
domain for: latestVersion
domain for: learningDeliveryType
domain for: maintenanceProcess
domain for: majorAlignment
domain for: minorAlignment
domain for: naics
domain for: name
domain for: narrowAlignment
domain for: nextVersion
domain for: occupationType
domain for: offeredBy
domain for: offeredIn
domain for: ownedBy
domain for: preparationFrom
domain for: previousVersion
domain for: processStandards
domain for: processStandardsDescription
domain for: recognizedBy
domain for: recognizedIn
domain for: recommends