Competency
type: Class
comment: Description of measurable or observable knowledge, skills, and abilities necessary to successful performance of a person in a given context.
description: Competency is broadly defined to include assertions of academic, professional, occupational, vocational and life goals, outcomes, and standards, however labeled.
term status: stable
change history: https://credreg.net/ctdl/termhistory/ceterms/Competency/json
subclass of: Statement
equivalent class: Statement