Condition Profile
type: Class
comment: Entity describing a constraint, prerequisite, entry condition, or requirement.
description: Constraints exist with credentials, learning opportunities, assessments and other entites to which they are subject during their lifecycles.
term status: stable
change history: https://credreg.net/ctdl/termhistory/ceterms/ConditionProfile/json
subclass of: CreativeWork
domain for: alternativeCondition
domain for: assertedBy
domain for: audienceLevelType
domain for: audienceType
domain for: commonCosts
domain for: condition
domain for: creditHourType
domain for: creditHourValue
domain for: creditUnitType
domain for: creditUnitTypeDescription
domain for: creditUnitValue
domain for: dateEffective
domain for: description
domain for: estimatedCost
domain for: experience
domain for: jurisdiction
domain for: minimumAge
domain for: name
domain for: residentOf
domain for: subjectWebpage
domain for: submissionOf
domain for: targetAssessment
domain for: targetCompetency
domain for: targetCredential
domain for: targetLearningOpportunity
domain for: targetPathway
domain for: targetTask
domain for: weight
domain for: yearsOfExperience