Cost Profile
type: Class
comment: Entity that describes direct costs one would incur if one were to pursue a credential, assessment, learning opportunity, or aspects thereof.
term status: stable
change history: https://credreg.net/ctdl/termhistory/ceterms/CostProfile/json
subclass of: CreativeWork
domain for: alternateName
domain for: audienceType
domain for: condition
domain for: costDetails
domain for: currency
domain for: description
domain for: directCostType
domain for: endDate
domain for: jurisdiction
domain for: name
domain for: paymentPattern
domain for: price
domain for: region
domain for: residencyType
domain for: startDate