Course Component
type: Class
comment: Resource that identifies a structured sequence of one or more learning activities that aims to develop a prescribed set of knowledge, skill, or ability of learners.
term status: stable
change history: https://credreg.net/ctdl/termhistory/ceterms/CourseComponent/json
subclass of: PathwayComponent
domain for: hasChild
domain for: isChildOf
domain for: componentDesignation
domain for: creditValue
domain for: ctid
domain for: description
domain for: hasCondition
domain for: identifier
domain for: isDestinationComponentOf
domain for: isPartOf
domain for: name
domain for: pointValue
domain for: precedes
domain for: prerequisite
domain for: programTerm
domain for: sourceData
domain for: subjectWebpage