Credential Alignment Object
type: Class
comment: Entity describing an affiliation or association between an entity such as a credential, learning opportunity or assessment and another entity in a structured framework such as a concept scheme, enumerated list, or competency framework.
term status: stable
change history: https://credreg.net/ctdl/termhistory/ceterms/CredentialAlignmentObject/json
subclass of: AlignmentObject
domain for: alignmentDate
domain for: alignmentType
domain for: codedNotation
domain for: framework
domain for: frameworkName
domain for: targetNode
domain for: targetNodeDescription
domain for: targetNodeName
domain for: weight