Credential Component
type: Class
comment: Resource that identifies another resource that describes qualification, achievement, personal or organizational quality, or aspect of an identity typically used to indicate suitability.
description: The ceterms:Credential class is broadly defined to encompass credentials used across domains and communities of practice. Subclasses of ceterms:Credential as defined by Credential Engine (or other communities) should be referenced.
term status: stable
change history: https://credreg.net/ctdl/termhistory/ceterms/CredentialComponent/json
subclass of: PathwayComponent
domain for: codedNotation
domain for: componentDesignation
domain for: credentialType
domain for: ctid
domain for: description
domain for: hasCondition
domain for: isDestinationComponentOf
domain for: isPartOf
domain for: name
domain for: pointValue
domain for: precedes
domain for: prerequisite
domain for: sourceData
domain for: subjectWebpage