Delivery Type
type: ConceptScheme
comment: Types of technical form for providing instances of the entity.
term status: stable
change history: https://credreg.net/ctdl/termhistory/ceterms/Delivery/json
has concept: Blended Delivery
has concept: In-Person Only
has concept: Online Only
has top concept: Blended Delivery
has top concept: In-Person Only
has top concept: Online Only

Blended Delivery
type: Concept
definition: Delivery includes significant levels of both in person and online.
term status: stable
change history: https://credreg.net/ctdl/termhistory/deliveryType/BlendedDelivery/json
in scheme: Delivery Type
top concept of: Delivery Type

In-Person Only
type: Concept
definition: Delivery is only face-to-face.
term status: stable
change history: https://credreg.net/ctdl/termhistory/deliveryType/InPerson/json
in scheme: Delivery Type
top concept of: Delivery Type

Online Only
type: Concept
definition: Delivery is only via the Internet.
term status: stable
change history: https://credreg.net/ctdl/termhistory/deliveryType/OnlineOnly/json
in scheme: Delivery Type
top concept of: Delivery Type