Geographic Coordinates
type: Class
comment: Geographic coordinates of a place or event including latitude and longitude as well as other locational information.
term status: stable
change history: https://credreg.net/ctdl/termhistory/ceterms/GeoCoordinates/json
subclass of: StructuredValue
equivalent class: GeoCoordinates
domain for: geoURI
domain for: latitude
domain for: longitude
domain for: name