Learning Resource
type: Class
comment: Entity that is used as part of an learning activity (e.g. a textbook) or that describes (e.g. a lesson plan) or records the educational activity (e.g. an audio- or video-recording of a lesson).
term status: stable
change history: https://credreg.net/ctdl/termhistory/ceterms/LearningResource/json
subclass of: CreativeWork
equivalent class: LearningResource