Open Badge
type: Class
comment: Visual symbol containing verifiable claims in accordance with the Open Badges specification and delivered digitally.
term status: stable
change history: https://credreg.net/ctdl/termhistory/ceterms/OpenBadge/json
subclass of: Badge
domain for: accreditedBy
domain for: accreditedIn
domain for: administrationProcess
domain for: advancedStandingFrom
domain for: alternateName
domain for: appealProcess
domain for: approvedBy
domain for: approvedIn
domain for: audienceLevelType
domain for: audienceType
domain for: availabilityListing
domain for: availableAt
domain for: availableOnlineAt
domain for: broadAlignment
domain for: codedNotation
domain for: commonConditions
domain for: commonCosts
domain for: complaintProcess
domain for: copyrightHolder
domain for: corequisite
domain for: credentialId
domain for: credentialStatusType
domain for: ctid
domain for: dateEffective
domain for: description
domain for: developmentProcess
domain for: earnings
domain for: employmentOutcome
domain for: estimatedCost
domain for: estimatedDuration
domain for: exactAlignment
domain for: financialAssistance
domain for: hasPart
domain for: holders
domain for: image
domain for: industryType
domain for: inLanguage
domain for: isAdvancedStandingFor
domain for: isPartOf
domain for: isPreparationFor
domain for: isRecommendedFor
domain for: isRequiredFor
domain for: jurisdiction
domain for: keyword
domain for: latestVersion
domain for: maintenanceProcess
domain for: majorAlignment
domain for: minorAlignment
domain for: naics
domain for: name
domain for: narrowAlignment
domain for: occupationType
domain for: offeredBy
domain for: offeredIn
domain for: ownedBy
domain for: preparationFrom
domain for: previousVersion
domain for: processStandards
domain for: processStandardsDescription
domain for: purposeType
domain for: recognizedBy
domain for: recognizedIn
domain for: recommends
domain for: region
domain for: regulatedBy
domain for: regulatedIn
domain for: relatedAction
domain for: renewal
domain for: renewalFrequency
domain for: renewedBy
domain for: renewedIn
domain for: requires
domain for: reviewProcess
domain for: revocation