Process Profile
type: Class
comment: Entity describing the type, nature, and other relevant information about a process related to a credential.
term status: stable
change history: https://credreg.net/ctdl/termhistory/ceterms/ProcessProfile/json
subclass of: CreativeWork
domain for: dateEffective
domain for: description
domain for: externalInputType
domain for: jurisdiction
domain for: processFrequency
domain for: processingAgent
domain for: processMethod
domain for: processMethodDescription
domain for: processStandards
domain for: processStandardsDescription
domain for: region
domain for: scoringMethodDescription
domain for: scoringMethodExample
domain for: scoringMethodExampleDescription
domain for: subjectWebpage
domain for: targetAssessment
domain for: targetCompetencyFramework
domain for: targetCredential
domain for: targetLearningOpportunity
domain for: verificationMethodDescription
domain for: dataCollectionMethodType