QA Credential Organization
type: Class
comment: Quality assurance organization that plays one or more key roles in the lifecycle of a credential, learning program, or assessment.
term status: stable
change history: https://credreg.net/ctdl/termhistory/ceterms/QACredentialOrganization/json
subclass of: Agent
subclass of: CredentialOrganization
domain for: accreditedBy
domain for: accreditedIn
domain for: accredits
domain for: address
domain for: administrationProcess
domain for: agentPurpose
domain for: agentPurposeDescription
domain for: agentSectorType
domain for: agentType
domain for: alternateName
domain for: alternativeIdentifier
domain for: appealProcess
domain for: approvedBy
domain for: approvedIn
domain for: approves
domain for: availabilityListing
domain for: complaintProcess
domain for: credentialingAction
domain for: ctid
domain for: department
domain for: description
domain for: developmentProcess
domain for: duns
domain for: email
domain for: employee
domain for: fein
domain for: foundingDate
domain for: hasConditionManifest
domain for: hasCostManifest
domain for: hasVerificationService
domain for: image
domain for: industryType
domain for: ipedsID
domain for: jurisdiction
domain for: keyword
domain for: leiCode
domain for: maintenanceProcess
domain for: missionAndGoalsStatement
domain for: missionAndGoalsStatementDescription
domain for: naics
domain for: name
domain for: offers
domain for: opeID
domain for: owns
domain for: parentOrganization
domain for: qualityAssuranceTargetType
domain for: recognizedBy
domain for: recognizedIn
domain for: recognizes
domain for: regulatedBy
domain for: regulatedIn
domain for: regulates
domain for: renews
domain for: reviewProcess
domain for: revocationProcess
domain for: revokes
domain for: sameAs
domain for: serviceType
domain for: socialMedia
domain for: subjectWebpage
domain for: subOrganization