Scoring Method
type: ConceptScheme
comment: Types of applicable scoring.
term status: stable
change history: https://credreg.net/ctdl/termhistory/ceterms/ScoringMethod/json
has concept: Criterion-Referenced
has concept: Norm-Referenced
has top concept: Criterion-Referenced
has top concept: Norm-Referenced

Criterion-Referenced
type: Concept
definition: Scored based on a comparison to defined criteria and levels of performance.
term status: stable
change history: https://credreg.net/ctdl/termhistory/score/CriterionReferenced/json
in scheme: Scoring Method
top concept of: Scoring Method

Norm-Referenced
type: Concept
definition: Scored based on a comparison to a distribution of performance in a reference population.
term status: stable
change history: https://credreg.net/ctdl/termhistory/score/NormReferenced/json
in scheme: Scoring Method
top concept of: Scoring Method