Task Profile
type: Class
comment: Entity describing the required or recommended tasks to be performed by a holder of, or applicant for, a credential.
term status: unstable
change history: https://credreg.net/ctdl/termhistory/ceterms/TaskProfile/json
subclass of: CreativeWork
domain for: affiliatedAgent
domain for: availabilityListing
domain for: availableAt
domain for: availableOnlineAt
domain for: dateEffective
domain for: description
domain for: estimatedCost
domain for: estimatedDuration
domain for: jurisdiction
domain for: name
domain for: taskDetails