Acting Agent
type: Property
comment: Organization or person performing an action.
term status: stable
change history: https://credreg.net/ctdl/termhistory/ceterms/actingAgent/json
domain includes: AccreditAction
domain includes: AdvancedStandingAction
domain includes: ApproveAction
domain includes: CredentialingAction
domain includes: OfferAction
domain includes: RecognizeAction
domain includes: RegulateAction
domain includes: RenewAction
domain includes: RevokeAction
domain includes: RightsAction
range includes: CredentialOrganization
range includes: CredentialPerson
range includes: QACredentialOrganization
equivalent property: agent