Action Status Type
type: Property
comment: Entity describing the current disposition or standing of an action; select from an existing enumeration of such types.
term status: stable
change history: https://credreg.net/ctdl/termhistory/ceterms/actionStatusType/json
sub property of: credentialAlignment
domain includes: AccreditAction
domain includes: AdvancedStandingAction
domain includes: ApproveAction
domain includes: CredentialingAction
domain includes: OfferAction
domain includes: RecognizeAction
domain includes: RegulateAction
domain includes: RenewAction
domain includes: RevokeAction
domain includes: RightsAction
range includes: CredentialAlignmentObject
target scheme: ActionStatus
equivalent property: actionStatusType