Agent
type: Property
comment: Direct agent or driver of the action.
usage note: The organization or person performing the action.
term status: deprecated
superseded by: actingAgent
change history: https://credreg.net/ctdl/termhistory/ceterms/agent/json
range includes: CredentialOrganization
range includes: CredentialPerson
range includes: QACredentialOrganization
equivalent property: agent