Alignment Type
type: Property
comment: Type of relationship between two entities.
description: In CTDL, the alignment type value is definitively identified by the property for which the AlignmentObject is the rdfs:range; therefore, use of this property is generally redundant.
term status: stable
change history: https://credreg.net/ctdl/termhistory/ceterms/alignmentType/json
domain includes: CredentialAlignmentObject
domain includes: FinancialAlignmentObject
range includes: string
equivalent property: alignmentType