Alternate Name
type: Property
comment: Alias for the entity including acronyms, alpha-numeric notations, and other forms of name abbreviations in common use.
term status: stable
change history: https://credreg.net/ctdl/termhistory/ceterms/alternateName/json
domain includes: AcademicCertificate
domain includes: AggregateDataProfile
domain includes: AlignmentMap
domain includes: ApprenticeshipCertificate
domain includes: AssessmentComponent
domain includes: AssessmentProfile
domain includes: AssociateDegree
domain includes: AssociateOfAppliedArtsDegree
domain includes: AssociateOfAppliedScienceDegree
domain includes: AssociateOfArtsDegree
domain includes: AssociateOfScienceDegree
domain includes: BachelorDegree
domain includes: BachelorOfArtsDegree
domain includes: BachelorOfScienceDegree
domain includes: Badge
domain includes: BasicComponent
domain includes: BasicTechnicalCertificate
domain includes: Certificate
domain includes: CertificateOfCompletion
domain includes: CertificateOfParticipation
domain includes: Certification
domain includes: CocurricularComponent
domain includes: Collection
domain includes: CollectionComponent
domain includes: CollectionMember
domain includes: CompetencyComponent
domain includes: ComponentCondition
domain includes: ConditionManifest
domain includes: ConditionProfile
domain includes: Constraint
domain includes: ContactPoint
domain includes: CostManifest
domain includes: CostProfile
domain includes: Course
domain includes: CourseComponent
domain includes: Credential
domain includes: CredentialComponent
domain includes: CredentialOrganization
domain includes: CredentialType
domain includes: Degree
domain includes: DigitalBadge
domain includes: Diploma
domain includes: DoctoralDegree
domain includes: EarningsProfile
domain includes: EmploymentOutcomeProfile
domain includes: ExtracurricularComponent
domain includes: FinancialAssistanceProfile
domain includes: GeneralEducationDevelopment
domain includes: GeneralEducationLevel1Certificate
domain includes: GeneralEducationLevel2Certificate
domain includes: GeoCoordinates
domain includes: HigherEducationLevel1Certificate
domain includes: HigherEducationLevel2Certificate
domain includes: HoldersProfile
domain includes: Industry
domain includes: Job
domain includes: JobComponent
domain includes: JourneymanCertificate
domain includes: LearningOpportunityProfile
domain includes: LearningProgram
domain includes: License
domain includes: MasterCertificate
domain includes: MasterDegree
domain includes: MasterOfArtsDegree
domain includes: MasterOfScienceDegree
domain includes: MicroCredential
domain includes: MultiComponent
domain includes: Occupation
domain includes: OpenBadge
domain includes: Organization
domain includes: Pathway
domain includes: PathwaySet
domain includes: Place
domain includes: PostalAddress
domain includes: PostBaccalaureateCertificate