Alternative Identifier
type: Property
comment: Alternative, publicly available and globally unique identifier for an organization issued by an authoritative entity.
description: The alternative identifier should be used where no identifier is available for the DUNS, FEIN, NAICS or IPEDS ID properties.
term status: stable
change history: https://credreg.net/ctdl/termhistory/ceterms/alternativeIdentifier/json
domain includes: CredentialOrganization
domain includes: QACredentialOrganization
range includes: IdentifierValue