Coded Notation
type: Property
comment: Set of alpha-numeric symbols that uniquely identifies an item and supports its discovery and use.
description: Examples include the alpha-numeric code "CCSS.MATH.CONTENT.HSA.CED.A.2" identifying a node in the U.S. Common Core State Standards on creating equations in algebra, or, the code "8021" in the U.S. Standard Industrial Classification (SIC) for identifying the occupational context for "Offices and Clinics of Dentists".
term status: stable
change history: https://credreg.net/ctdl/termhistory/ceterms/codedNotation/json
domain includes: ApprenticeshipCertificate
domain includes: AssessmentComponent
domain includes: AssessmentProfile
domain includes: AssociateDegree
domain includes: BachelorDegree
domain includes: Badge
domain includes: BasicComponent
domain includes: Certificate
domain includes: Certification
domain includes: CocurricularComponent
domain includes: CompetencyComponent
domain includes: CourseComponent
domain includes: Credential
domain includes: CredentialAlignmentObject
domain includes: CredentialComponent
domain includes: Degree
domain includes: DigitalBadge
domain includes: Diploma
domain includes: DoctoralDegree
domain includes: ExtracurricularComponent
domain includes: FinancialAlignmentObject
domain includes: GeneralEducationDevelopment
domain includes: JobComponent
domain includes: JourneymanCertificate
domain includes: LearningOpportunityProfile
domain includes: License
domain includes: MasterCertificate
domain includes: MasterDegree
domain includes: MicroCredential
domain includes: OpenBadge
domain includes: ProfessionalDoctorate
domain includes: QualityAssuranceCredential
domain includes: ResearchDoctorate
domain includes: SecondarySchoolDiploma
domain includes: WorkExperienceComponent
range includes: string