Contact Type
type: Property
comment: Text identifying the type of service provided by an organizational contact.
description: A person or organization may have different contact points for different services. The contact type property provides for adding text to identity the service; e.g., "toll-free number" or "support for hearing-impaired callers".
term status: stable
change history: https://credreg.net/ctdl/termhistory/ceterms/contactType/json
domain includes: ContactPoint
range includes: langString