Credential Alignment
type: Property
comment: Relationship between an entity and an established framework such as competency frameworks and concept schemes representing industries, occupations, and instructional environments.
term status: deprecated
change history: https://credreg.net/ctdl/termhistory/ceterms/credentialAlignment/json
range includes: CredentialAlignmentObject