Employee
type: Property
comment: Person employed for wages or salary by the organization.
term status: stable
change history: https://credreg.net/ctdl/termhistory/ceterms/employee/json
domain includes: CredentialOrganization
domain includes: QACredentialOrganization
range includes: CredentialPerson
equivalent property: employee