Evidence of Action
type: Property
comment: Entity that proves that the action occurred or that the action continues to be valid.
description: The evidence verifies the information in the action and is particular to it. It is not a directory of such evidentiary entities or a description of how such verifications might generically be characterized.
term status: stable
change history: https://credreg.net/ctdl/termhistory/ceterms/evidenceOfAction/json
domain includes: AccreditAction
domain includes: AdvancedStandingAction
domain includes: ApproveAction
domain includes: CredentialingAction
domain includes: OfferAction
domain includes: RecognizeAction
domain includes: RegulateAction
domain includes: RenewAction
domain includes: RevokeAction
domain includes: RightsAction
range includes: anyURI