External Input Type
type: Property
comment: Types of external stakeholders that provide input to an entity's processes or resources; select from an existing enumeration of such types.
usage note: Best practice for developing credential descriptions for the Credential Engine Registry is to use the ceterms:ExternalInput vocabulary.
term status: stable
change history: https://credreg.net/ctdl/termhistory/ceterms/externalInputType/json
sub property of: credentialAlignment
domain includes: ProcessProfile
range includes: CredentialAlignmentObject
target scheme: ExternalInput