Geographic URI
type: Property
comment: Entity that describes the longitude, latitude and other location details of a place.
description: This may define a place at any scale. Examples include a city, state, province, country, or continent.
usage note: It is recommended to use services such as http://www.geonames.org to provide values for this property.
term status: stable
change history: https://credreg.net/ctdl/termhistory/ceterms/geoURI/json
domain includes: GeoCoordinates
domain includes: Place
range includes: anyURI