Given Name
type: Property
comment: First name of a person.
usage note: Family name can be used along with familyName instead of the name property.
term status: stable
change history: https://credreg.net/ctdl/termhistory/ceterms/givenName/json
domain includes: CredentialPerson
range includes: langString
equivalent property: givenName