Has Destination Component
type: Property
comment: Goal or destination node of the pathway.
term status: stable
change history: https://credreg.net/ctdl/termhistory/ceterms/hasDestinationComponent/json
domain includes: Pathway
range includes: AssessmentComponent
range includes: BasicComponent
range includes: CocurricularComponent
range includes: CompetencyComponent
range includes: CourseComponent
range includes: CredentialComponent
range includes: ExtracurricularComponent
range includes: JobComponent
range includes: SelectionComponent
range includes: WorkExperienceComponent