Has Group Participation
type: Property
comment: Whether or not two or more participants are required to complete the assessment activity.
term status: stable
change history: https://credreg.net/ctdl/termhistory/ceterms/hasGroupParticipation/json
domain includes: AssessmentProfile
range includes: boolean