Has Statement
type: Property
comment: Alignment assertion belonging to the alignment map.
term status: stable
change history: https://credreg.net/ctdl/termhistory/ceterms/hasStatement/json
domain includes: AlignmentMap
range includes: Statement