Identifier
type: Property
comment: Alphanumeric token that identifies this resource and information about the token's originating context or scheme.
usage note: Where a more specific property exists, such as ceterms:opeID, ceterms:ncesID, ceterms:leiCode, etc., use that property instead of this one.
term status: stable
change history: https://credreg.net/ctdl/termhistory/ceterms/identifier/json
domain includes: ApprenticeshipCertificate
domain includes: AssessmentComponent
domain includes: AssessmentProfile
domain includes: AssociateDegree
domain includes: BachelorDegree
domain includes: Badge
domain includes: BasicComponent
domain includes: Certificate
domain includes: CertificateOfCompletion
domain includes: Certification
domain includes: CocurricularComponent
domain includes: CompetencyComponent
domain includes: CourseComponent
domain includes: Credential
domain includes: CredentialComponent
domain includes: CredentialOrganization
domain includes: Degree
domain includes: DigitalBadge
domain includes: Diploma
domain includes: DoctoralDegree
domain includes: ExtracurricularComponent
domain includes: GeneralEducationDevelopment
domain includes: Job
domain includes: JobComponent
domain includes: JourneymanCertificate
domain includes: LearningOpportunityProfile
domain includes: License
domain includes: MasterCertificate
domain includes: MasterDegree
domain includes: MicroCredential
domain includes: Occupation
domain includes: OpenBadge
domain includes: Place
domain includes: ProfessionalDoctorate
domain includes: QACredentialOrganization
domain includes: QualityAssuranceCredential
domain includes: ResearchDoctorate
domain includes: SecondarySchoolDiploma
domain includes: SelectionComponent
domain includes: Task
domain includes: TransferValueProfile
domain includes: WorkExperienceComponent
domain includes: WorkRole
range includes: IdentifierValue