Identifier
type: Property
comment: Alphanumeric token that identifies this resource and information about the token's originating context or scheme.
usage note: Where a specific property for the originating context or scheme exists, such as ceterms:opeID, ceterms:ncesID, ceterms:leiCode, etc., use that property instead of this one. Where the identifier has no nameable originating context or scheme other than that of the resource being identified, ceterms:codedNotation may be used.
term status: stable
change history: https://credreg.net/ctdl/termhistory/ceterms/identifier/json
domain includes: Rubric
domain includes: AcademicCertificate
domain includes: AccreditAction
domain includes: AdvancedStandingAction
domain includes: AlignmentMap
domain includes: ApprenticeshipCertificate
domain includes: ApproveAction
domain includes: AssessmentComponent
domain includes: AssessmentProfile
domain includes: AssociateDegree
domain includes: AssociateOfAppliedArtsDegree
domain includes: AssociateOfAppliedScienceDegree
domain includes: AssociateOfArtsDegree
domain includes: AssociateOfScienceDegree
domain includes: BachelorDegree
domain includes: BachelorOfArtsDegree
domain includes: BachelorOfScienceDegree
domain includes: Badge
domain includes: BasicComponent
domain includes: BasicTechnicalCertificate
domain includes: Certificate
domain includes: CertificateOfCompletion
domain includes: CertificateOfParticipation
domain includes: Certification
domain includes: CocurricularComponent
domain includes: CollectionComponent
domain includes: CompetencyComponent
domain includes: Course
domain includes: CourseComponent
domain includes: Credential
domain includes: CredentialComponent
domain includes: CredentialingAction
domain includes: CredentialOrganization
domain includes: CredentialType
domain includes: Degree
domain includes: DigitalBadge
domain includes: Diploma
domain includes: DoctoralDegree
domain includes: ExtracurricularComponent
domain includes: GeneralEducationDevelopment
domain includes: GeneralEducationLevel1Certificate
domain includes: GeneralEducationLevel2Certificate
domain includes: HigherEducationLevel1Certificate
domain includes: HigherEducationLevel2Certificate
domain includes: Industry
domain includes: Job
domain includes: JobComponent
domain includes: JourneymanCertificate
domain includes: LearningOpportunityProfile
domain includes: LearningProgram
domain includes: License
domain includes: MasterCertificate
domain includes: MasterDegree
domain includes: MasterOfArtsDegree
domain includes: MasterOfScienceDegree
domain includes: MicroCredential
domain includes: MultiComponent
domain includes: Occupation
domain includes: OfferAction
domain includes: OpenBadge
domain includes: Organization
domain includes: Place
domain includes: PostBaccalaureateCertificate
domain includes: PostMasterCertificate
domain includes: PreApprenticeshipCertificate
domain includes: PriorLearningPolicy
domain includes: ProfessionalCertificate
domain includes: ProfessionalDoctorate
domain includes: ProficiencyCertificate
domain includes: QACredentialOrganization
domain includes: QualificationsFramework
domain includes: QualityAssuranceCredential
domain includes: RecognizeAction
domain includes: RegulateAction