In Language
type: Property
comment: Primary language of the credential, learning opportunity or assessment.
description: This is the primary language the entity, even if the it makes use of other languages. For example, a course that teaches Spanish to English-speaking students may primarily be in English, because that is the language used to convey the material.
term status: stable
change history: https://credreg.net/ctdl/termhistory/ceterms/inLanguage/json
domain includes: ApprenticeshipCertificate
domain includes: AssessmentProfile
domain includes: AssociateDegree
domain includes: BachelorDegree
domain includes: Badge
domain includes: Certificate
domain includes: Certification
domain includes: Credential
domain includes: Degree
domain includes: DigitalBadge
domain includes: Diploma
domain includes: DoctoralDegree
domain includes: GeneralEducationDevelopment
domain includes: JourneymanCertificate
domain includes: LearningOpportunityProfile
domain includes: License
domain includes: MasterCertificate
domain includes: MasterDegree
domain includes: MicroCredential
domain includes: OpenBadge
domain includes: ProfessionalDoctorate
domain includes: QualityAssuranceCredential
domain includes: ResearchDoctorate
domain includes: SecondarySchoolDiploma
range includes: language
equivalent property: inLanguage