Industry Type
type: Property
comment: Type of industry; select from an existing enumeration of such types such as the SIC, NAICS, and ISIC classifications.
usage note: Best practice in identifying industries for U.S. credentials is to provide the NAICS code using the ceterms:naics property. Other credentials may use the ceterms:industrytype property and any framework of the class ceterms:IndustryClassification.
term status: stable
change history: https://credreg.net/ctdl/termhistory/ceterms/industryType/json
sub property of: credentialAlignment
domain includes: ApprenticeshipCertificate
domain includes: AssociateDegree
domain includes: BachelorDegree
domain includes: Badge
domain includes: Certificate
domain includes: Certification
domain includes: Credential
domain includes: CredentialOrganization
domain includes: Degree
domain includes: DigitalBadge
domain includes: Diploma
domain includes: DoctoralDegree
domain includes: GeneralEducationDevelopment
domain includes: JourneymanCertificate
domain includes: License
domain includes: MasterCertificate
domain includes: MasterDegree
domain includes: MicroCredential
domain includes: OpenBadge
domain includes: ProfessionalDoctorate
domain includes: QACredentialOrganization
domain includes: QualityAssuranceCredential
domain includes: ResearchDoctorate
domain includes: SecondarySchoolDiploma
range includes: CredentialAlignmentObject
target scheme: IndustryClassification