Instrument
type: Property
comment: Object that helped the agent perform the action. e.g. John wrote a book with a pen.
description: A credential or other instrument whose criteria was applied in executing the action.
term status: stable
change history: https://credreg.net/ctdl/termhistory/ceterms/instrument/json
domain includes: AccreditAction
domain includes: AdvancedStandingAction
domain includes: ApproveAction
domain includes: CredentialingAction
domain includes: OfferAction
domain includes: RecognizeAction
domain includes: RegulateAction
domain includes: RenewAction
domain includes: RevokeAction
domain includes: RightsAction
range includes: ApprenticeshipCertificate
range includes: AssociateDegree
range includes: BachelorDegree
range includes: Badge
range includes: Certificate
range includes: Certification
range includes: Credential
range includes: Degree
range includes: DigitalBadge
range includes: Diploma
range includes: DoctoralDegree
range includes: GeneralEducationDevelopment
range includes: JourneymanCertificate
range includes: License
range includes: MasterCertificate
range includes: MasterDegree
range includes: MicroCredential
range includes: OpenBadge
range includes: ProfessionalDoctorate
range includes: QualityAssuranceCredential
range includes: ResearchDoctorate
range includes: SecondarySchoolDiploma
equivalent property: instrument