Is Part Of
type: Property
comment: Indicates another entity of which this entity is a component.
description: Covers partitive notions such as "embedded".
term status: stable
change history: https://credreg.net/ctdl/termhistory/ceterms/isPartOf/json
domain includes: ApprenticeshipCertificate
domain includes: AssessmentComponent
domain includes: AssociateDegree
domain includes: BachelorDegree
domain includes: Badge
domain includes: BasicComponent
domain includes: Certificate
domain includes: Certification
domain includes: CocurricularComponent
domain includes: CompetencyComponent
domain includes: CourseComponent
domain includes: Credential
domain includes: CredentialComponent
domain includes: Degree
domain includes: DigitalBadge
domain includes: Diploma
domain includes: DoctoralDegree
domain includes: ExtracurricularComponent
domain includes: GeneralEducationDevelopment
domain includes: JobComponent
domain includes: JourneymanCertificate
domain includes: LearningOpportunityProfile
domain includes: License
domain includes: MasterCertificate
domain includes: MasterDegree
domain includes: MicroCredential
domain includes: OpenBadge
domain includes: ProfessionalDoctorate
domain includes: QualityAssuranceCredential
domain includes: ResearchDoctorate
domain includes: SecondarySchoolDiploma
domain includes: WorkExperienceComponent
range includes: ApprenticeshipCertificate
range includes: AssessmentComponent
range includes: AssociateDegree
range includes: BachelorDegree
range includes: Badge
range includes: BasicComponent
range includes: Certificate
range includes: Certification
range includes: CocurricularComponent
range includes: CompetencyComponent
range includes: ComponentCondition
range includes: CourseComponent
range includes: Credential
range includes: CredentialComponent
range includes: Degree
range includes: DigitalBadge
range includes: Diploma
range includes: DoctoralDegree
range includes: ExtracurricularComponent
range includes: GeneralEducationDevelopment
range includes: JobComponent
range includes: JourneymanCertificate
range includes: LearningOpportunityProfile
range includes: License
range includes: MasterCertificate
range includes: MasterDegree
range includes: MicroCredential
range includes: OpenBadge
range includes: ProfessionalDoctorate
range includes: QualityAssuranceCredential
range includes: ResearchDoctorate
range includes: SecondarySchoolDiploma
range includes: WorkExperienceComponent
equivalent property: isPartOf