Learning Method Type
type: Property
comment: Types of methods used to conduct the learning opportunity; select from an existing enumeration of such types.
usage note: Best practice is to use concepts from a controlled vocabulary such as the ceterms:LearningMethod.
term status: stable
change history: https://credreg.net/ctdl/termhistory/ceterms/learningMethodType/json
domain includes: LearningOpportunityProfile
range includes: CredentialAlignmentObject
target scheme: LearningMethod