Learning Opportunity Offered
type: Property
comment: Learning opportunity offered by the agent.
term status: deprecated
change history: https://credreg.net/ctdl/termhistory/ceterms/learningOpportunityOffered/json
range includes: LearningOpportunityProfile