Legal Entity Identifier Code
type: Property
comment: A 20-digit, alpha-numeric code, based on the ISO 17442 standard, for identifying legal entities participating in financial transactions.
term status: stable
change history: https://credreg.net/ctdl/termhistory/ceterms/leiCode/json
domain includes: CredentialOrganization
domain includes: QACredentialOrganization
range includes: string
equivalent property: leiCode