Maximum Value
type: Property
comment: The upper value of some characteristic or property.
usage note: For single values, use schema:value. For ranges, use schema:minValue and schema:maxValue.
term status: stable
change history: https://credreg.net/ctdl/termhistory/schema/maxValue/json
domain includes: ValueProfile
domain includes: QuantitativeValue
range includes: float