Minimum Value
type: Property
comment: The lower value of some characteristic or property.
usage note: In CTDL: for single values, use schema:value; for ranges, use schema:minValue and schema:maxValue.
term status: stable
change history: https://credreg.net/ctdl/termhistory/schema/minValue/json
domain includes: CriterionLevel
domain includes: ValueProfile
domain includes: Observation
domain includes: MonetaryAmount
domain includes: QuantitativeValue
range includes: float