Minimum Age
type: Property
comment: Minimum allowed age at which a person is eligible for the credential.
term status: stable
change history: https://credreg.net/ctdl/termhistory/ceterms/minimumAge/json
domain includes: ConditionProfile
range includes: integer