Mission and Goals Statement Description
type: Property
comment: Textual statement of the mission and goals of the organization.
term status: stable
change history: https://credreg.net/ctdl/termhistory/ceterms/missionAndGoalsStatementDescription/json
domain includes: CredentialOrganization
domain includes: QACredentialOrganization
range includes: langString