Owns
type: Property
comment: Resource over which the organization or person claims legal title.
term status: stable
change history: https://credreg.net/ctdl/termhistory/ceterms/owns/json
domain includes: CredentialOrganization
domain includes: Organization
domain includes: QACredentialOrganization
range includes: AcademicCertificate
range includes: AlignmentMap
range includes: ApprenticeshipCertificate
range includes: AssessmentProfile
range includes: AssociateDegree
range includes: AssociateOfAppliedArtsDegree
range includes: AssociateOfAppliedScienceDegree
range includes: AssociateOfArtsDegree
range includes: AssociateOfScienceDegree
range includes: BachelorDegree
range includes: BachelorOfArtsDegree
range includes: BachelorOfScienceDegree
range includes: Badge
range includes: BasicTechnicalCertificate
range includes: Certificate
range includes: CertificateOfCompletion
range includes: CertificateOfParticipation
range includes: Certification
range includes: Course
range includes: Credential
range includes: Degree
range includes: DigitalBadge
range includes: Diploma
range includes: DoctoralDegree
range includes: GeneralEducationDevelopment
range includes: GeneralEducationLevel1Certificate
range includes: GeneralEducationLevel2Certificate
range includes: HigherEducationLevel1Certificate
range includes: HigherEducationLevel2Certificate
range includes: JourneymanCertificate
range includes: LearningOpportunityProfile
range includes: LearningProgram
range includes: License
range includes: MasterCertificate
range includes: MasterDegree
range includes: MasterOfArtsDegree
range includes: MasterOfScienceDegree
range includes: MicroCredential
range includes: OpenBadge
range includes: Pathway
range includes: PostBaccalaureateCertificate
range includes: PostMasterCertificate
range includes: PreApprenticeshipCertificate
range includes: PriorLearningPolicy
range includes: ProfessionalCertificate
range includes: ProfessionalDoctorate
range includes: ProficiencyCertificate
range includes: QualificationsFramework
range includes: QualityAssuranceCredential
range includes: ResearchDoctorate
range includes: SecondaryEducationCertificate
range includes: SecondarySchoolDiploma
range includes: SpecialistDegree
range includes: SupportService
range includes: TechnicalLevel1Certificate
range includes: TechnicalLevel2Certificate
range includes: TechnicalLevel3Certificate
range includes: TransferValueAgreement
range includes: TransferValueProfile
range includes: WorkBasedLearningCertificate