Payment Pattern
type: Property
comment: Applicable pattern for payments such as "per semester" and "every three months".
term status: stable
change history: https://credreg.net/ctdl/termhistory/ceterms/paymentPattern/json
domain includes: CostProfile
range includes: langString