Percentage
type: Property
comment: Quotient of two values of the data set, expressed as a percentage.
usage note: Best practice is to treat the value of this property as a verbatim percentage; for example, a value of 1.5 should be interpreted as 1.5%
term status: stable
change history: https://credreg.net/ctdl/termhistory/qdata/percentage/json
domain includes: CriterionLevel
domain includes: ValueProfile
domain includes: Observation
domain includes: QuantitativeValue
range includes: float