Prerequisite
type: Property
comment: Resource that is required as a prior condition to this resource.
term status: stable
change history: https://credreg.net/ctdl/termhistory/ceterms/prerequisite/json
domain includes: AssessmentComponent
domain includes: BasicComponent
domain includes: CocurricularComponent
domain includes: CompetencyComponent
domain includes: CourseComponent
domain includes: CredentialComponent
domain includes: ExtracurricularComponent
domain includes: JobComponent
domain includes: SelectionComponent
domain includes: WorkExperienceComponent
range includes: AssessmentComponent
range includes: BasicComponent
range includes: CocurricularComponent
range includes: CompetencyComponent
range includes: CourseComponent
range includes: CredentialComponent
range includes: ExtracurricularComponent
range includes: JobComponent
range includes: SelectionComponent
range includes: WorkExperienceComponent